Target
Type-2 angiotensin II receptor
Ligand
BDBM50049189
Substrate
Meas. Tech.
ChEMBL_35278 (CHEMBL648317)
Ki
2.8±n/a nM
Citation
 Wan, YWallinder, CJohansson, BHolm, MMahalingam, AKWu, XBotros, MKarlén, APettersson, ANyberg, FFändriks, LHallberg, AAlterman, M First reported nonpeptide AT1 receptor agonist (L-162,313) acts as an AT2 receptor agonist in vivo. J Med Chem 47:1536-46 (2004)  
Target
Name:
Type-2 angiotensin II receptor
Synonyms:
AGTR2 AT2 Angiotensin II type 2 (AT-2) receptor Type-2 angiotensin II receptor
Type:
Enzyme Catalytic Domain
Mol. Mass.:
41201.61
Organism:
Homo sapiens (Human)
Description:
Angiotensin II, central 0 0::P50052
Residue:
363
  
Inhibitor
Name:
BDBM50049189
Synonyms:
3-[4-(2-Ethyl-57-dimethyl-imidazo[45-b]pyridin-3-ylmethyl)-phenyl]-5-isobutyl-thiophene-2-sulfonic acid butyloxycarbonylamide(L-162313) L-162313 | butyl 3-(4-((2-ethyl-5,7-dimethyl-3H-imidazo[4,5-b]pyridin-3-yl)methyl)phenyl)-5-isobutylthiophen-2-ylsulfonylcarbamate
Type:
Small organic molecule
Emp. Form.:
C30H38N4O4S2
Mol. Mass.:
582.777
SMILES:
CCCCOC(=O)NS(=O)(=O)c1sc(CC(C)C)cc1-c1ccc(Cn2c(CC)nc3c(C)cc(C)nc23)cc1
: