Target
Nitric oxide synthase, endothelial
Ligand
BDBM50141088
Substrate
Meas. Tech.
ChEMBL_65158 (CHEMBL678359)
IC50
5750±n/a nM
Citation
 Lowe, JAQian, WDrozda, SEVolkmann, RANason, DNelson, RBNolan, CListon, DWard, KFaraci, SVerdries, KSeymour, PMajchrzak, MVillalobos, AWhite, WF Structure-activity relationships of potent, selective inhibitors of neuronal nitric oxide synthase based on the 6-phenyl-2-aminopyridine structure. J Med Chem 47:1575-86 (2004)  
Target
Name:
Nitric oxide synthase, endothelial
Synonyms:
Constitutive NOS Endothelial NOS NOS type III NOS3_HUMAN Nitric oxide synthase (inducible and endothelial) Nitric-oxide synthase (endothelial and brain) eNOS
Type:
Enzyme Catalytic Domain
Mol. Mass.:
133297.84
Organism:
Homo sapiens (Human)
Description:
P29474
Residue:
1203
  
Inhibitor
Name:
BDBM50141088
Synonyms:
6-[4-(2-Dimethylamino-ethoxy)-6,7,8,9-tetrahydro-5H-benzocyclohepten-1-yl]-pyridin-2-ylamine | CHEMBL42969
Type:
Small organic molecule
Emp. Form.:
C20H27N3O
Mol. Mass.:
325.4479
SMILES:
CN(C)CCOc1ccc(-c2cccc(N)n2)c2CCCCCc12
: