Target
Integrin alpha-V/beta-3
Ligand
BDBM50141322
Substrate
Meas. Tech.
ChEMBL_32653 (CHEMBL642148)
IC50
1.8±n/a nM
Citation
 Penning, TDRussell, MAChen, BBChen, HYDesai, BNDocter, SHEdwards, DJGesicki, GJLiang, CDMalecha, JWYu, SSEngleman, VWFreeman, SKHanneke, MLShannon, KEWestlin, MMNickols, GA Synthesis of cinnamic acids and related isosteres as potent and selective alpha v beta 3 receptor antagonists. Bioorg Med Chem Lett 14:1471-6 (2004)  
Target
Name:
Integrin alpha-V/beta-3
Synonyms:
ITGAV/ITGB3 | Integrin beta-3/Vitronectin receptor alpha
Type:
Enzyme
Mol. Mass.:
Description:
Components:
This complex has 2 components.
Component 1
Name:
Integrin alpha-V
Synonyms:
ITAV_HUMAN Integrin alpha-V/alpha-5 VNRA Vitronectin receptor | Vitronectin receptor subunit alpha
Type:
PROTEIN
Mol. Mass.:
116024.92
Organism:
Homo sapiens (Human)
Description:
ChEMBL_582336
Residue:
1048
  
Component 2
Name:
Integrin beta-3
Synonyms:
CD_antigen=CD61 GPIIIa ITGB3 Platelet membrane glycoprotein IIIa
Type:
Protein
Mol. Mass.:
87038.91
Organism:
Homo sapiens (Human)
Description:
P05106
Residue:
788
  
Inhibitor
Name:
BDBM50141322
Synonyms:
3-{4-[3-(1,4,5,6-Tetrahydro-pyrimidin-2-ylamino)-benzoylamino]-phenyl}-acrylic acid | CHEMBL417330
Type:
Small organic molecule
Emp. Form.:
C20H20N4O3
Mol. Mass.:
364.3978
SMILES:
OC(=O)C=Cc1ccc(NC(=O)c2cccc(NC3=NCCCN3)c2)cc1
: