Target
Integrin alpha-V/beta-3
Ligand
BDBM50141333
Substrate
Meas. Tech.
ChEMBL_32660 (CHEMBL642828)
IC50
0.510000±n/a nM
Citation
 Penning, TDRussell, MAChen, BBChen, HYDesai, BNDocter, SHEdwards, DJGesicki, GJLiang, CDMalecha, JWYu, SSEngleman, VWFreeman, SKHanneke, MLShannon, KEWestlin, MMNickols, GA Synthesis of cinnamic acids and related isosteres as potent and selective alpha v beta 3 receptor antagonists. Bioorg Med Chem Lett 14:1471-6 (2004)  
Target
Name:
Integrin alpha-V/beta-3
Synonyms:
ITGAV/ITGB3 | Integrin beta-3/Vitronectin receptor alpha
Type:
Enzyme
Mol. Mass.:
Description:
Components:
This complex has 2 components.
Component 1
Name:
Integrin alpha-V
Synonyms:
ITAV_HUMAN Integrin alpha-V/alpha-5 VNRA Vitronectin receptor | Vitronectin receptor subunit alpha
Type:
PROTEIN
Mol. Mass.:
116024.92
Organism:
Homo sapiens (Human)
Description:
ChEMBL_582336
Residue:
1048
  
Component 2
Name:
Integrin beta-3
Synonyms:
CD_antigen=CD61 GPIIIa ITGB3 Platelet membrane glycoprotein IIIa
Type:
Protein
Mol. Mass.:
87038.91
Organism:
Homo sapiens (Human)
Description:
P05106
Residue:
788
  
Inhibitor
Name:
BDBM50141333
Synonyms:
2-tert-Butoxycarbonylamino-3-[4-(3-guanidino-benzoylamino)-phenyl]-propionic acid | CHEMBL284274
Type:
Small organic molecule
Emp. Form.:
C22H27N5O5
Mol. Mass.:
441.4803
SMILES:
[#6]C([#6])([#6])[#8]-[#6](=O)-[#7]-[#6](-[#6]-c1ccc(-[#7]-[#6](=O)-c2cccc(c2)\[#7]=[#6](/[#7])-[#7])cc1)-[#6](-[#8])=O
: