Target
Endothelin-1 receptor
Ligand
BDBM50141475
Substrate
Meas. Tech.
ChEBML_65489
IC50
0.014000±n/a nM
Citation
 Takahashi, HOhtake, NSakamoto, TIino, TKawanishi, NNakamura, MYoshizumi, TNiiyama, KOzaki, SOkada, HKano, ATakahashi, HIshii, YOkada, MSaito, MSawazaki, YHayama, TNishikibe, M Structure-activity relationships of a novel class of endothelin receptor selective antagonists; 6-carboxy-2-isopropylamino-5,7-diarylcyclopenteno[1,2-b]pyridines. Bioorg Med Chem Lett 14:1503-7 (2004)  
Target
Name:
Endothelin-1 receptor
Synonyms:
EDNRA ET-A ETA-R Endothelin receptor type A hET-AR
Type:
Enzyme Catalytic Domain
Mol. Mass.:
48736.88
Organism:
Homo sapiens (Human)
Description:
P25101
Residue:
427
  
Inhibitor
Name:
BDBM50141475
Synonyms:
(5S,6R,7R)-5-Benzo[1,3]dioxol-5-yl-7-[2-(2-hydroxy-2-methyl-propyl)-4-methoxy-phenyl]-2-isopropylamino-6,7-dihydro-5H-[1]pyrindine-6-carboxylic acid | CHEMBL432856
Type:
Small organic molecule
Emp. Form.:
C30H34N2O6
Mol. Mass.:
518.6008
SMILES:
COc1ccc([C@H]2[C@@H]([C@H](c3ccc(NC(C)C)nc23)c2ccc3OCOc3c2)C(O)=O)c(CC(C)(C)O)c1
: