Target
Beta-secretase 1
Ligand
BDBM50141552
Substrate
Meas. Tech.
ChEMBL_41394 (CHEMBL653516)
IC50
16±n/a nM
Citation
 Kimura, TShuto, DKasai, SLiu, PHidaka, KHamada, THayashi, YHattori, CAsai, MKitazume, SSaido, TCIshiura, SKiso, Y KMI-358 and KMI-370, highly potent and small-sized BACE1 inhibitors containing phenylnorstatine. Bioorg Med Chem Lett 14:1527-31 (2004)  
Target
Name:
Beta-secretase 1
Synonyms:
ASP2 Aspartyl protease 2 BACE1 Beta-secretase (BACE) Beta-secretase 1 (BACE 1) Beta-secretase 1 (BACE1) Beta-site amyloid precursor protein cleaving enzyme 1 Memapsin-2 beta-Secretase (BACE-1) | beta-Secretase (BACE1)
Type:
Protein
Mol. Mass.:
55755.10
Organism:
Homo sapiens (Human)
Description:
P56817
Residue:
501
  
Inhibitor
Name:
BDBM50141552
Synonyms:
3-[(S)-3-((S)-2-{(S)-2-[2-Amino-3-((S)-carboxyamino)-propionylamino]-3-methyl-butyrylamino}-4-methyl-pentanoylamino)-2-(R)-hydroxy-4-phenyl-butyrylamino]-benzoic acid | CHEMBL38830
Type:
Small organic molecule
Emp. Form.:
C32H44N6O9
Mol. Mass.:
656.7266
SMILES:
CC(C)C[C@H](NC(=O)[C@@H](NC(=O)[C@@H](N)CNC(O)=O)C(C)C)C(=O)N[C@@H](Cc1ccccc1)[C@@H](O)C(=O)Nc1cccc(c1)C(O)=O
: