Target
Beta-secretase 1
Ligand
BDBM50141553
Substrate
Meas. Tech.
ChEMBL_41394 (CHEMBL653516)
IC50
55±n/a nM
Citation
 Kimura, TShuto, DKasai, SLiu, PHidaka, KHamada, THayashi, YHattori, CAsai, MKitazume, SSaido, TCIshiura, SKiso, Y KMI-358 and KMI-370, highly potent and small-sized BACE1 inhibitors containing phenylnorstatine. Bioorg Med Chem Lett 14:1527-31 (2004)  
Target
Name:
Beta-secretase 1
Synonyms:
ASP2 Aspartyl protease 2 BACE1 Beta-secretase (BACE) Beta-secretase 1 (BACE 1) Beta-secretase 1 (BACE1) Beta-site amyloid precursor protein cleaving enzyme 1 Memapsin-2 beta-Secretase (BACE-1) | beta-Secretase (BACE1)
Type:
Protein
Mol. Mass.:
55755.10
Organism:
Homo sapiens (Human)
Description:
P56817
Residue:
501
  
Inhibitor
Name:
BDBM50141553
Synonyms:
5-((2R,3S)-3-((S)-2-((S)-2-((S)-2-amino-4-carboxybutanamido)-3-methylbutanamido)-4-methylpentanamido)-2-hydroxy-4-phenylbutanamido)isophthalic acid CHEMBL288919
Type:
Small organic molecule
Emp. Form.:
C34H45N5O11
Mol. Mass.:
699.748
SMILES:
CC(C)C[C@H](NC(=O)[C@@H](NC(=O)[C@@H](N)CCC(O)=O)C(C)C)C(=O)N[C@@H](Cc1ccccc1)[C@@H](O)C(=O)Nc1cc(cc(c1)C(O)=O)C(O)=O
: