Target
C-C chemokine receptor type 5
Ligand
BDBM50141851
Substrate
Meas. Tech.
ChEMBL_44682 (CHEMBL656554)
IC50
7.5±n/a nM
Citation
 Shen, DMShu, MMills, SGChapman, KTMalkowitz, LSpringer, MSGould, SLDeMartino, JASiciliano, SJKwei, GYCarella, ACarver, GHolmes, KSchleif, WADanzeisen, RHazuda, DKessler, JLineberger, JMiller, MDEmini, EA Antagonists of human CCR5 receptor containing 4-(pyrazolyl)piperidine side chains. Part 1: Discovery and SAR study of 4-pyrazolylpiperidine side chains. Bioorg Med Chem Lett 14:935-9 (2004)  
Target
Name:
C-C chemokine receptor type 5
Synonyms:
C-C CKR-5 CC-CKR-5 CCR5 CCR5_HUMAN CHEMR13 HIV-1 fusion coreceptor
Type:
Enzyme
Mol. Mass.:
40540.21
Organism:
Homo sapiens (Human)
Description:
P51681
Residue:
352
  
Inhibitor
Name:
BDBM50141851
Synonyms:
(3-{4-[5-(4-Cyano-phenyl)-2H-pyrazol-3-yl]-piperidin-1-ylmethyl}-4-phenyl-pyrrolidin-1-yl)-cyclohexyl-acetic acid | CHEMBL367446
Type:
Small organic molecule
Emp. Form.:
C34H41N5O2
Mol. Mass.:
551.7216
SMILES:
OC(=O)[C@@H](C1CCCCC1)N1C[C@H](CN2CCC(CC2)c2cc(n[nH]2)-c2ccc(cc2)C#N)[C@H](C1)c1ccccc1
: