Target
Plasminogen
Ligand
BDBM50142155
Substrate
Meas. Tech.
ChEBML_155053
IC50
>11000±n/a nM
Citation
 Zhang, PBao, LZuckett, JFJia, ZJWoolfrey, JArfsten, AEdwards, SSinha, UHutchaleelaha, ALambing, JLHollenbach, SJScarborough, RMZhu, BY Design, synthesis, and SAR of anthranilamide-based factor Xa inhibitors with improved functional activity. Bioorg Med Chem Lett 14:989-93 (2004)  
Target
Name:
Plasminogen
Synonyms:
Activation peptide PLG Plasmin Plasmin heavy chain A, short form | Plasmin light chain B
Type:
Enzyme
Mol. Mass.:
90579.18
Organism:
Homo sapiens (Human)
Description:
Residue:
810
  
Inhibitor
Name:
BDBM50142155
Synonyms:
5-Chloro-N-(5-chloro-pyridin-2-yl)-2-(4-pyrrolidin-1-ylmethyl-benzoylamino)-benzamide | CHEMBL425859
Type:
Small organic molecule
Emp. Form.:
C24H22Cl2N4O2
Mol. Mass.:
469.363
SMILES:
Clc1ccc(NC(=O)c2cc(Cl)ccc2NC(=O)c2ccc(CN3CCCC3)cc2)nc1
: