Target
Plasminogen
Ligand
BDBM50142175
Substrate
Meas. Tech.
ChEBML_155053
IC50
>11000±n/a nM
Citation
 Zhang, PBao, LZuckett, JFJia, ZJWoolfrey, JArfsten, AEdwards, SSinha, UHutchaleelaha, ALambing, JLHollenbach, SJScarborough, RMZhu, BY Design, synthesis, and SAR of anthranilamide-based factor Xa inhibitors with improved functional activity. Bioorg Med Chem Lett 14:989-93 (2004)  
Target
Name:
Plasminogen
Synonyms:
Activation peptide PLG Plasmin Plasmin heavy chain A, short form | Plasmin light chain B
Type:
Enzyme
Mol. Mass.:
90579.18
Organism:
Homo sapiens (Human)
Description:
Residue:
810
  
Inhibitor
Name:
BDBM50142175
Synonyms:
5-Chloro-N-(5-chloro-pyridin-2-yl)-2-(4-{[(4,5-dihydro-1H-imidazol-2-yl)-methyl-amino]-methyl}-benzoylamino)-benzamide | CHEMBL355807
Type:
Small organic molecule
Emp. Form.:
C24H22Cl2N6O2
Mol. Mass.:
497.376
SMILES:
CN(Cc1ccc(cc1)C(=O)Nc1ccc(Cl)cc1C(=O)Nc1ccc(Cl)cn1)C1=NCCN1
: