Target
Prostaglandin E2 receptor EP4 subtype
Ligand
BDBM50142478
Substrate
Meas. Tech.
ChEMBL_158452 (CHEMBL763256)
EC50
360±n/a nM
Citation
 Elworthy, TRKertesz, DJKim, WRoepel, MGQuattrocchio-Setti, LSmith, DBTracy, JLChow, ALi, FBrill, ERLach, LKMcGee, DYang, DSChiou, SS Lactams as EP4 prostanoid receptor subtype selective agonists. Part 1: 2-Pyrrolidinones-stereochemical and lower side-chain optimization. Bioorg Med Chem Lett 14:1655-9 (2004)  
Target
Name:
Prostaglandin E2 receptor EP4 subtype
Synonyms:
PE2R4_HUMAN PGE2 receptor EP4 subtype PTGER4 Prostanoid EP4 receptor
Type:
Enzyme
Mol. Mass.:
53134.53
Organism:
Homo sapiens (Human)
Description:
P35408
Residue:
488
  
Inhibitor
Name:
BDBM50142478
Synonyms:
7-[(R)-2-((E)-3-Biphenyl-3-yl-3-hydroxy-propenyl)-5-oxo-pyrrolidin-1-yl]-heptanoic acid | CHEMBL47018
Type:
Small organic molecule
Emp. Form.:
C26H31NO4
Mol. Mass.:
421.5286
SMILES:
OC(\C=C\[C@H]1CCC(=O)N1CCCCCCC(O)=O)c1cccc(c1)-c1ccccc1
: