Target
Prostaglandin E2 receptor EP3 subtype
Ligand
BDBM50142490
Substrate
Meas. Tech.
ChEBML_158328
Ki
4900±n/a nM
Citation
 Elworthy, TRKertesz, DJKim, WRoepel, MGQuattrocchio-Setti, LSmith, DBTracy, JLChow, ALi, FBrill, ERLach, LKMcGee, DYang, DSChiou, SS Lactams as EP4 prostanoid receptor subtype selective agonists. Part 1: 2-Pyrrolidinones-stereochemical and lower side-chain optimization. Bioorg Med Chem Lett 14:1655-9 (2004)  
Target
Name:
Prostaglandin E2 receptor EP3 subtype
Synonyms:
PE2R3_HUMAN PGE2-R Prostaglandin E2 receptor Prostaglandin E2 receptor EP3 subtype (EP3) Prostaglandin E2 receptor EP3D subtype (EP3D) | Prostanoid EP3 receptor
Type:
Enzyme
Mol. Mass.:
43335.03
Organism:
Homo sapiens (Human)
Description:
P43115
Residue:
390
  
Inhibitor
Name:
BDBM50142490
Synonyms:
7-{(R)-2-[(E)-3-Hydroxy-3-(5-trifluoromethyl-furan-2-yl)-propenyl]-5-oxo-pyrrolidin-1-yl}-heptanoic acid | CHEMBL45418
Type:
Small organic molecule
Emp. Form.:
C19H24F3NO5
Mol. Mass.:
403.3928
SMILES:
OC(\C=C\[C@H]1CCC(=O)N1CCCCCCC(O)=O)c1ccc(o1)C(F)(F)F
: