Target
Prostaglandin E2 receptor EP2 subtype
Ligand
BDBM50142477
Substrate
Meas. Tech.
ChEBML_158313
Ki
71000±n/a nM
Citation
 Elworthy, TRKertesz, DJKim, WRoepel, MGQuattrocchio-Setti, LSmith, DBTracy, JLChow, ALi, FBrill, ERLach, LKMcGee, DYang, DSChiou, SS Lactams as EP4 prostanoid receptor subtype selective agonists. Part 1: 2-Pyrrolidinones-stereochemical and lower side-chain optimization. Bioorg Med Chem Lett 14:1655-9 (2004)  
Target
Name:
Prostaglandin E2 receptor EP2 subtype
Synonyms:
PE2R2_HUMAN PTGER2 Prostaglandin E2 receptor Prostanoid EP2 Receptor
Type:
Enzyme
Mol. Mass.:
39775.71
Organism:
Homo sapiens (Human)
Description:
P43116
Residue:
358
  
Inhibitor
Name:
BDBM50142477
Synonyms:
7-[(R)-2-((E)-(S)-4-Cyclohexyl-3-hydroxy-but-1-enyl)-5-oxo-pyrrolidin-1-yl]-heptanoic acid | CHEMBL42129
Type:
Small organic molecule
Emp. Form.:
C21H35NO4
Mol. Mass.:
365.5069
SMILES:
O[C@@H](CC1CCCCC1)\C=C\[C@H]1CCC(=O)N1CCCCCCC(O)=O
: