Target
Prostaglandin E2 receptor EP2 subtype
Ligand
BDBM50142490
Substrate
Meas. Tech.
ChEBML_158313
Ki
58000±n/a nM
Citation
 Elworthy, TRKertesz, DJKim, WRoepel, MGQuattrocchio-Setti, LSmith, DBTracy, JLChow, ALi, FBrill, ERLach, LKMcGee, DYang, DSChiou, SS Lactams as EP4 prostanoid receptor subtype selective agonists. Part 1: 2-Pyrrolidinones-stereochemical and lower side-chain optimization. Bioorg Med Chem Lett 14:1655-9 (2004)  
Target
Name:
Prostaglandin E2 receptor EP2 subtype
Synonyms:
PE2R2_HUMAN PTGER2 Prostaglandin E2 receptor Prostanoid EP2 Receptor
Type:
Enzyme
Mol. Mass.:
39775.71
Organism:
Homo sapiens (Human)
Description:
P43116
Residue:
358
  
Inhibitor
Name:
BDBM50142490
Synonyms:
7-{(R)-2-[(E)-3-Hydroxy-3-(5-trifluoromethyl-furan-2-yl)-propenyl]-5-oxo-pyrrolidin-1-yl}-heptanoic acid | CHEMBL45418
Type:
Small organic molecule
Emp. Form.:
C19H24F3NO5
Mol. Mass.:
403.3928
SMILES:
OC(\C=C\[C@H]1CCC(=O)N1CCCCCCC(O)=O)c1ccc(o1)C(F)(F)F
: