Target
Prostaglandin E2 receptor EP4 subtype
Ligand
BDBM50142496
Substrate
Meas. Tech.
ChEBML_158452
EC50
>100000±n/a nM
Citation
 Elworthy, TRKertesz, DJKim, WRoepel, MGQuattrocchio-Setti, LSmith, DBTracy, JLChow, ALi, FBrill, ERLach, LKMcGee, DYang, DSChiou, SS Lactams as EP4 prostanoid receptor subtype selective agonists. Part 1: 2-Pyrrolidinones-stereochemical and lower side-chain optimization. Bioorg Med Chem Lett 14:1655-9 (2004)  
Target
Name:
Prostaglandin E2 receptor EP4 subtype
Synonyms:
PE2R4_HUMAN PGE2 receptor EP4 subtype PTGER4 Prostanoid EP4 receptor
Type:
Enzyme
Mol. Mass.:
53134.53
Organism:
Homo sapiens (Human)
Description:
P35408
Residue:
488
  
Inhibitor
Name:
BDBM50142496
Synonyms:
7-[(S)-2-((E)-(S)-3-Hydroxy-oct-1-enyl)-5-oxo-pyrrolidin-1-yl]-heptanoic acid | CHEMBL295623
Type:
Small organic molecule
Emp. Form.:
C19H33NO4
Mol. Mass.:
339.4696
SMILES:
CCCCC[C@H](O)\C=C\[C@@H]1CCC(=O)N1CCCCCCC(O)=O
: