Target
DNA topoisomerase 2-alpha/2-beta
Ligand
BDBM50142519
Substrate
Meas. Tech.
ChEMBL_54378 (CHEMBL666728)
Ki
74100±n/a nM
Citation
 Abdel-Aziz, MMatsuda, KOtsuka, MUyeda, MOkawara, TSuzuki, K Inhibitory activities against topoisomerase I and II by polyhydroxybenzoyl amide derivatives and their structure-activity relationship. Bioorg Med Chem Lett 14:1669-72 (2004)  
Target
Name:
DNA topoisomerase 2-alpha/2-beta
Synonyms:
DNA topoisomerase II
Type:
Mol. Mass.:
Description:
ASSAY_ID of ChEMBL is 1821483
Components:
This complex has 2 components.
Component 1
Name:
DNA topoisomerase 2-alpha
Synonyms:
DNA topoisomerase 2-alpha DNA topoisomerase II (Topo II) DNA topoisomerase II, alpha isozyme TOP2A Topoisomerase I/II | Topoisomerase II alpha (HuTopoIIα)
Type:
Protein
Mol. Mass.:
174415.30
Organism:
Homo sapiens (Human)
Description:
P11388
Residue:
1531
  
Component 2
Name:
DNA topoisomerase 2-beta
Synonyms:
DNA topoisomerase II TOP2B | TOP2B_HUMAN
Type:
PROTEIN
Mol. Mass.:
183284.13
Organism:
Homo sapiens (Human)
Description:
ChEMBL_51583
Residue:
1626
  
Inhibitor
Name:
BDBM50142519
Synonyms:
CHEMBL47027 | N-[2-(3,4,5-triihydroxy-benzoylamino)-phenyl]-3,4,5-trihydroxy-benzamide
Type:
Small organic molecule
Emp. Form.:
C20H16N2O8
Mol. Mass.:
412.3496
SMILES:
Oc1cc(cc(O)c1O)C(=O)Nc1ccccc1NC(=O)c1cc(O)c(O)c(O)c1
: