Target
Follicle-stimulating hormone receptor
Ligand
BDBM50142652
Substrate
Meas. Tech.
ChEBML_68376
EC50
3900±n/a nM
Citation
 Guo, TAdang, AEDolle, REDong, GFitzpatrick, DGeng, PHo, KKKultgen, SGLiu, RMcDonald, EMcGuinness, BFSaionz, KWValenzano, KJvan Straten, NCXie, DWebb, ML Small molecule biaryl FSH receptor agonists. Part 1: Lead discovery via encoded combinatorial synthesis. Bioorg Med Chem Lett 14:1713-6 (2004)  
Target
Name:
Follicle-stimulating hormone receptor
Synonyms:
FSH-R FSHR_HUMAN Follicle-stimulating hormone receptor LGR1
Type:
PROTEIN
Mol. Mass.:
78273.21
Organism:
Homo sapiens (Human)
Description:
ChEMBL_1351769
Residue:
695
  
Inhibitor
Name:
BDBM50142652
Synonyms:
CHEMBL47120 | {2'-[(Acetyl-butyl-amino)-methyl]-biphenyl-4-ylmethyl}-[(cyclopropylmethyl-carbamoyl)-methyl]-carbamic acid butyl ester
Type:
Small organic molecule
Emp. Form.:
C31H43N3O4
Mol. Mass.:
521.6908
SMILES:
CCCCOC(=O)N(CC(=O)NCC1CC1)Cc1ccc(cc1)-c1ccccc1CN(CCCC)C(C)=O
: