Target
Follicle-stimulating hormone receptor
Ligand
BDBM50142678
Substrate
Meas. Tech.
ChEBML_69355
EC50
150±n/a nM
Citation
 Guo, TAdang, AEDong, GFitzpatrick, DGeng, PHo, KKJibilian, CHKultgen, SGLiu, RMcDonald, ESaionz, KWValenzano, KJvan Straten, NCXie, DWebb, ML Small molecule biaryl FSH receptor agonists. Part 2: Lead optimization via parallel synthesis. Bioorg Med Chem Lett 14:1717-20 (2004)  
Target
Name:
Follicle-stimulating hormone receptor
Synonyms:
FSH-R FSHR_HUMAN Follicle-stimulating hormone receptor LGR1
Type:
PROTEIN
Mol. Mass.:
78273.21
Organism:
Homo sapiens (Human)
Description:
ChEMBL_1351769
Residue:
695
  
Inhibitor
Name:
BDBM50142678
Synonyms:
CHEMBL44663 | N-Butyl-N-[4'-((2S,5S)-4-hexyl-1,5-dimethyl-3,6-dioxo-piperazin-2-ylmethyl)-biphenyl-3-ylmethyl]-acetamide
Type:
Small organic molecule
Emp. Form.:
C32H45N3O3
Mol. Mass.:
519.718
SMILES:
CCCCCCN1[C@@H](C)C(=O)N(C)[C@@H](Cc2ccc(cc2)-c2cccc(CN(CCCC)C(C)=O)c2)C1=O
: