Target
Follicle-stimulating hormone receptor
Ligand
BDBM50142663
Substrate
Meas. Tech.
ChEBML_69355
EC50
>20000±n/a nM
Citation
 Guo, TAdang, AEDong, GFitzpatrick, DGeng, PHo, KKJibilian, CHKultgen, SGLiu, RMcDonald, ESaionz, KWValenzano, KJvan Straten, NCXie, DWebb, ML Small molecule biaryl FSH receptor agonists. Part 2: Lead optimization via parallel synthesis. Bioorg Med Chem Lett 14:1717-20 (2004)  
Target
Name:
Follicle-stimulating hormone receptor
Synonyms:
FSH-R FSHR_HUMAN Follicle-stimulating hormone receptor LGR1
Type:
PROTEIN
Mol. Mass.:
78273.21
Organism:
Homo sapiens (Human)
Description:
ChEMBL_1351769
Residue:
695
  
Inhibitor
Name:
BDBM50142663
Synonyms:
2-[(S)-2,5-Dioxo-3-(3',4',5'-trimethoxy-biphenyl-4-ylmethyl)-piperazin-1-yl]-N-hexyl-acetamide | CHEMBL43789
Type:
Small organic molecule
Emp. Form.:
C28H37N3O6
Mol. Mass.:
511.6099
SMILES:
CCCCCCNC(=O)CN1CC(=O)N[C@@H](Cc2ccc(cc2)-c2cc(OC)c(OC)c(OC)c2)C1=O
: