Target
Muscarinic acetylcholine receptor M2
Ligand
BDBM50142802
Substrate
Meas. Tech.
ChEBML_139762
Ki
15±n/a nM
Citation
 Palani, ADugar, SClader, JWGreenlee, WJRuperto, VDuffy, RALachowicz, JE Isopropyl amide derivatives of potent and selective muscarinic M2 receptor antagonists. Bioorg Med Chem Lett 14:1791-4 (2004)  
Target
Name:
Muscarinic acetylcholine receptor M2
Synonyms:
ACM2_HUMAN Cholinergic, muscarinic M2 Muscarinic acetylcholine receptor M2 and M5 | RecName: Full=Muscarinic acetylcholine receptor M2
Type:
GPCR
Mol. Mass.:
51730.61
Organism:
Homo sapiens (Human)
Description:
P08172
Residue:
466
  
Inhibitor
Name:
BDBM50142802
Synonyms:
CHEMBL51339 | N-Cyclohexyl-4-[1'-(2-methyl-benzoyl)-[1,4']bipiperidinyl-4-ylmethyl]-benzamide
Type:
Small organic molecule
Emp. Form.:
C32H43N3O2
Mol. Mass.:
501.7027
SMILES:
Cc1ccccc1C(=O)N1CCC(CC1)N1CCC(Cc2ccc(cc2)C(=O)NC2CCCCC2)CC1
: