Target
Neuronal acetylcholine receptor subunit alpha-2/beta-2
Ligand
BDBM50100707
Substrate
Meas. Tech.
ChEMBL_143226 (CHEMBL750087)
Ki
0.002±n/a nM
Citation
 Carroll, FI Epibatidine structure-activity relationships. Bioorg Med Chem Lett 14:1889-96 (2004)  
Target
Name:
Neuronal acetylcholine receptor subunit alpha-2/beta-2
Synonyms:
Neuronal acetylcholine receptor protein alpha-2/beta-2 subunit nAChR subtypes alpha2 beta2
Type:
Mol. Mass.:
Description:
ASSAY_ID of EBI is 143226
Components:
This complex has 2 components.
Component 1
Name:
Neuronal acetylcholine receptor subunit alpha-2
Synonyms:
ACHA2_RAT Cholinergic, Nicotinic Alpha2Beta2 Chrna2
Type:
Enzyme
Mol. Mass.:
58597.25
Organism:
Rattus norvegicus (Rat)
Description:
P12389
Residue:
511
  
Component 2
Name:
Neuronal acetylcholine receptor subunit beta-2
Synonyms:
ACHB2_RAT Chrnb2 Neuronal acetylcholine receptor non-alpha-1 chain
Type:
Enzyme
Mol. Mass.:
56910.32
Organism:
Rattus norvegicus (Rat)
Description:
P12390
Residue:
500
  
Inhibitor
Name:
BDBM50100707
Synonyms:
(R)-2-(6-Fluoro-pyridin-3-yl)-7-aza-bicyclo[2.2.1]heptane 2-(6-fluoropyridin-3-yl)-7-aza-bicyclo[2.2.1]heptane | CHEMBL56682
Type:
Small organic molecule
Emp. Form.:
C11H13FN2
Mol. Mass.:
192.2327
SMILES:
Fc1ccc(cn1)C1CC2CCC1N2
: