Target
Prostaglandin G/H synthase 2
Ligand
BDBM50143480
Substrate
Meas. Tech.
ChEBML_157991
IC50
>100000±n/a nM
Citation
 Uddin, MJRao, PNKnaus, EE Design of acyclic triaryl olefins: a new class of potent and selective cyclooxygenase-2 (COX-2) inhibitors. Bioorg Med Chem Lett 14:1953-6 (2004)  
Target
Name:
Prostaglandin G/H synthase 2
Synonyms:
COX2 Cyclooxygenase-2 (COX-2) PTGS2 Prostaglandin G/H synthase (cyclooxygenase)
Type:
Protein
Mol. Mass.:
68976.98
Organism:
Ovis aries (Sheep)
Description:
Residue:
603
  
Inhibitor
Name:
BDBM50143480
Synonyms:
4-(1-Benzhydrylidene-hexadecyl)-benzenesulfonic acid methyl ester | CHEMBL175028
Type:
Small organic molecule
Emp. Form.:
C36H48O3S
Mol. Mass.:
560.83
SMILES:
[#6]-[#6]-[#6]-[#6]-[#6]-[#6]-[#6]-[#6]-[#6]-[#6]-[#6]-[#6]-[#6]-[#6]-[#6]\[#6](=[#6](/c1ccccc1)-c1ccccc1)-c1ccc(cc1)S(=O)(=O)[#8]-[#6]
: