Target
Legumain
Ligand
BDBM50143614
Substrate
Meas. Tech.
ChEMBL_96917 (CHEMBL707896)
IC50
38±n/a nM
Citation
 Ekici, ODGötz, MGJames, KELi, ZZRukamp, BJAsgian, JLCaffrey, CRHansell, EDvorák, JMcKerrow, JHPotempa, JTravis, JMikolajczyk, JSalvesen, GSPowers, JC Aza-peptide Michael acceptors: a new class of inhibitors specific for caspases and other clan CD cysteine proteases. J Med Chem 47:1889-92 (2004)  
Target
Name:
Legumain
Synonyms:
3.4.22.34 LGMN PRSC1 | Protease, cysteine 1
Type:
Mol. Mass.:
49411.12
Organism:
Homo sapiens (Human)
Description:
Residue:
433
  
Inhibitor
Name:
BDBM50143614
Synonyms:
(E)-3-{(S)-N'-[(S)-2-((S)-2-Benzyloxycarbonylamino-propionylamino)-propionyl]-N-carbamoylmethyl-hydrazinocarbonyloxy}-acrylic acid benzyl ester | CHEMBL292589
Type:
Small organic molecule
Emp. Form.:
C27H31N5O9
Mol. Mass.:
569.5631
SMILES:
C[C@H](NC(=O)OCc1ccccc1)C(=O)N[C@@H](C)C(=O)NN(CC(N)=O)C(=O)O\C=C\C(=O)OCc1ccccc1
: