Target
Capsid scaffolding protein
Ligand
BDBM50143618
Substrate
Meas. Tech.
ChEMBL_77299 (CHEMBL687228)
IC50
6.6±n/a nM
Citation
 Gopalsamy, ALim, KEllingboe, JWMitsner, BNikitenko, AUpeslacis, JMansour, TSOlson, MWBebernitz, GAGrinberg, DFeld, BMoy, FJO'Connell, J Design and syntheses of 1,6-naphthalene derivatives as selective HCMV protease inhibitors. J Med Chem 47:1893-9 (2004)  
Target
Name:
Capsid scaffolding protein
Synonyms:
APNG Assembly protein Human cytomegalovirus protease (HCMV Pr) Protease precursor UL80 | pPR
Type:
PROTEIN
Mol. Mass.:
73854.16
Organism:
Human cytomegalovirus (strain AD169) (HHV-5) (Human herpesvirus 5)
Description:
ChEMBL_158958
Residue:
708
  
Inhibitor
Name:
BDBM50143618
Synonyms:
C,C,C-Trifluoro-N-{5-[2-(3-methoxy-phenyl)-vinyl]-naphthalen-2-yl}-methanesulfonamide | CHEMBL59436
Type:
Small organic molecule
Emp. Form.:
C20H16F3NO3S
Mol. Mass.:
407.406
SMILES:
COc1cccc(\C=C\c2cccc3cc(NS(=O)(=O)C(F)(F)F)ccc23)c1
: