Target
Capsid scaffolding protein
Ligand
BDBM50143651
Substrate
Meas. Tech.
ChEMBL_77299 (CHEMBL687228)
IC50
>50±n/a nM
Citation
 Gopalsamy, ALim, KEllingboe, JWMitsner, BNikitenko, AUpeslacis, JMansour, TSOlson, MWBebernitz, GAGrinberg, DFeld, BMoy, FJO'Connell, J Design and syntheses of 1,6-naphthalene derivatives as selective HCMV protease inhibitors. J Med Chem 47:1893-9 (2004)  
Target
Name:
Capsid scaffolding protein
Synonyms:
APNG Assembly protein Human cytomegalovirus protease (HCMV Pr) Protease precursor UL80 | pPR
Type:
PROTEIN
Mol. Mass.:
73854.16
Organism:
Human cytomegalovirus (strain AD169) (HHV-5) (Human herpesvirus 5)
Description:
ChEMBL_158958
Residue:
708
  
Inhibitor
Name:
BDBM50143651
Synonyms:
5-[(E)-2-(7-Chloro-quinolin-2-yl)-vinyl]-naphthalen-2-ylamine | CHEMBL292678
Type:
Small organic molecule
Emp. Form.:
C21H15ClN2
Mol. Mass.:
330.81
SMILES:
Nc1ccc2c(\C=C\c3ccc4ccc(Cl)cc4n3)cccc2c1
: