Target
Alpha-1B adrenergic receptor
Ligand
BDBM50143654
Substrate
Meas. Tech.
ChEMBL_34190 (CHEMBL649207)
Ki
86.96±n/a nM
Citation
 Leonardi, ABarlocco, DMontesano, FCignarella, GMotta, GTesta, RPoggesi, ESeeber, MDe Benedetti, PGFanelli, F Synthesis, screening, and molecular modeling of new potent and selective antagonists at the alpha 1d adrenergic receptor. J Med Chem 47:1900-18 (2004)  
Target
Name:
Alpha-1B adrenergic receptor
Synonyms:
ADA1B_HUMAN Adrenergic alpha1B Adrenergic receptor alpha Alpha 1B-adrenoreceptor | Alpha-1B adrenergic receptor
Type:
Enzyme
Mol. Mass.:
56862.13
Organism:
Homo sapiens (Human)
Description:
P35368
Residue:
520
  
Inhibitor
Name:
BDBM50143654
Synonyms:
8-{2-[4-(2-Chloro-phenyl)-piperazin-1-yl]-ethyl}-8-aza-spiro[4.5]decane-7,9-dione | CHEMBL57593
Type:
Small organic molecule
Emp. Form.:
C21H28ClN3O2
Mol. Mass.:
389.919
SMILES:
Clc1ccccc1N1CCN(CCN2C(=O)CC3(CCCC3)CC2=O)CC1
: