Target
Alpha-1B adrenergic receptor
Ligand
BDBM50143720
Substrate
Meas. Tech.
ChEMBL_34190 (CHEMBL649207)
Ki
13.11±n/a nM
Citation
 Leonardi, ABarlocco, DMontesano, FCignarella, GMotta, GTesta, RPoggesi, ESeeber, MDe Benedetti, PGFanelli, F Synthesis, screening, and molecular modeling of new potent and selective antagonists at the alpha 1d adrenergic receptor. J Med Chem 47:1900-18 (2004)  
Target
Name:
Alpha-1B adrenergic receptor
Synonyms:
ADA1B_HUMAN Adrenergic alpha1B Adrenergic receptor alpha Alpha 1B-adrenoreceptor | Alpha-1B adrenergic receptor
Type:
Enzyme
Mol. Mass.:
56862.13
Organism:
Homo sapiens (Human)
Description:
P35368
Residue:
520
  
Inhibitor
Name:
BDBM50143720
Synonyms:
8-{2-[4-(2,5-Dichloro-phenyl)-piperazin-1-yl]-1-methyl-ethyl}-8-aza-spiro[4.5]decane-7,9-dione | CHEMBL300152
Type:
Small organic molecule
Emp. Form.:
C22H29Cl2N3O2
Mol. Mass.:
438.391
SMILES:
CC(CN1CCN(CC1)c1cc(Cl)ccc1Cl)N1C(=O)CC2(CCCC2)CC1=O
: