Target
Alpha-1D adrenergic receptor
Ligand
BDBM50143655
Substrate
Meas. Tech.
ChEMBL_32721 (CHEMBL645993)
Ki
3.66±n/a nM
Citation
 Leonardi, ABarlocco, DMontesano, FCignarella, GMotta, GTesta, RPoggesi, ESeeber, MDe Benedetti, PGFanelli, F Synthesis, screening, and molecular modeling of new potent and selective antagonists at the alpha 1d adrenergic receptor. J Med Chem 47:1900-18 (2004)  
Target
Name:
Alpha-1D adrenergic receptor
Synonyms:
ADA1D_RAT Adra1d Alpha-1D adrenergic receptor | Serotonin 1a (5-HT1a) receptor/Adrenergic receptor alpha-1
Type:
Protein
Mol. Mass.:
59375.97
Organism:
Rattus norvegicus (Rat)
Description:
P23944
Residue:
561
  
Inhibitor
Name:
BDBM50143655
Synonyms:
8-[2-(4-Phenyl-piperidin-1-yl)-ethyl]-8-aza-spiro[4.5]decane-7,9-dione | CHEMBL292686
Type:
Small organic molecule
Emp. Form.:
C22H30N2O2
Mol. Mass.:
354.4858
SMILES:
O=C1CC2(CCCC2)CC(=O)N1CCN1CCC(CC1)c1ccccc1
: