Target
Alpha-1D adrenergic receptor
Ligand
BDBM50143687
Substrate
Meas. Tech.
ChEMBL_32721 (CHEMBL645993)
Ki
0.2±n/a nM
Citation
 Leonardi, ABarlocco, DMontesano, FCignarella, GMotta, GTesta, RPoggesi, ESeeber, MDe Benedetti, PGFanelli, F Synthesis, screening, and molecular modeling of new potent and selective antagonists at the alpha 1d adrenergic receptor. J Med Chem 47:1900-18 (2004)  
Target
Name:
Alpha-1D adrenergic receptor
Synonyms:
ADA1D_RAT Adra1d Alpha-1D adrenergic receptor | Serotonin 1a (5-HT1a) receptor/Adrenergic receptor alpha-1
Type:
Protein
Mol. Mass.:
59375.97
Organism:
Rattus norvegicus (Rat)
Description:
P23944
Residue:
561
  
Inhibitor
Name:
BDBM50143687
Synonyms:
4-Chloro-2-{4-[2-(7,9-dioxo-8-aza-spiro[4.5]dec-8-yl)-ethyl]-piperazin-1-yl}-benzonitrile | CHEMBL57868
Type:
Small organic molecule
Emp. Form.:
C22H27ClN4O2
Mol. Mass.:
414.928
SMILES:
Clc1ccc(C#N)c(c1)N1CCN(CCN2C(=O)CC3(CCCC3)CC2=O)CC1
: