Target
C-C chemokine receptor type 5
Ligand
BDBM50143751
Substrate
Meas. Tech.
ChEMBL_224029 (CHEMBL840572)
IC50
102±n/a nM
Citation
 Thoma, GNuninger, FSchaefer, MAkyel, KGAlbert, RBeerli, CBruns, CFrancotte, ELuyten, MMacKenzie, DOberer, LStreiff, MBWagner, TWalter, HWeckbecker, GZerwes, HG Orally bioavailable competitive CCR5 antagonists. J Med Chem 47:1939-55 (2004)  
Target
Name:
C-C chemokine receptor type 5
Synonyms:
C-C CKR-5 CC-CKR-5 CCR5 CCR5_HUMAN CHEMR13 HIV-1 fusion coreceptor
Type:
Enzyme
Mol. Mass.:
40540.21
Organism:
Homo sapiens (Human)
Description:
P51681
Residue:
352
  
Inhibitor
Name:
BDBM50143751
Synonyms:
(4-Diphenylamino-4'-methyl-[1,4']bipiperidinyl-1'-yl)-(1H-indol-4-yl)-methanone | CHEMBL293900
Type:
Small organic molecule
Emp. Form.:
C32H36N4O
Mol. Mass.:
492.6544
SMILES:
CC1(CCN(CC1)C(=O)c1cccc2[nH]ccc12)N1CCC(CC1)N(c1ccccc1)c1ccccc1
: