Target
Vitamin D3 receptor
Ligand
BDBM50409926
Substrate
Meas. Tech.
ChEMBL_214322 (CHEMBL818350)
EC50
0.4±n/a nM
Citation
 Tocchini-Valentini, GRochel, NWurtz, JMMoras, D Crystal structures of the vitamin D nuclear receptor liganded with the vitamin D side chain analogues calcipotriol and seocalcitol, receptor agonists of clinical importance. Insights into a structural basis for the switching of calcipotriol to a receptor antagonist by further side chain modificatio J Med Chem 47:1956-61 (2004)  
Target
Name:
Vitamin D3 receptor
Synonyms:
1,25-dihydroxyvitamin D3 receptor Nuclear receptor subfamily 1 group I member 1 VDR | VDR_HUMAN
Type:
Protein
Mol. Mass.:
48288.72
Organism:
Homo sapiens (Human)
Description:
P11473
Residue:
427
  
Inhibitor
Name:
BDBM50409926
Synonyms:
CHEMBL2112314
Type:
Small organic molecule
Emp. Form.:
C32H48O5
Mol. Mass.:
512.7205
SMILES:
CCCCOC(=O)C1(CC1)[C@H](O)\C=C\[C@@H](C)[C@H]1CC[C@H]2\C(CCC[C@]12C)=C\C=C1\C[C@@H](O)C[C@H](O)C1=C
: