Target
Retinoic acid receptor alpha
Ligand
BDBM50143828
Substrate
Meas. Tech.
ChEMBL_197387 (CHEMBL799706)
EC50
>10000±n/a nM
Citation
 Haffner, CDLenhard, JMMiller, ABMcDougald, DLDwornik, KIttoop, ORGampe, RTXu, HEBlanchard, SMontana, VGConsler, TGBledsoe, RKAyscue, ACroom, D Structure-based design of potent retinoid X receptor alpha agonists. J Med Chem 47:2010-29 (2004)  
Target
Name:
Retinoic acid receptor alpha
Synonyms:
NR1B1 RAR-alpha RARA_HUMAN Retinoic acid receptor alpha/Retinoid X receptor alpha Retinoid receptor
Type:
PROTEIN
Mol. Mass.:
50778.87
Organism:
Homo sapiens (Human)
Description:
ChEMBL_1466191
Residue:
462
  
Inhibitor
Name:
BDBM50143828
Synonyms:
3-[4-(5,5,8,8-Tetramethyl-5,6,7,8-tetrahydro-naphthalen-2-yl)-4,5,6,7-tetrahydro-benzo[b]thiophen-2-yl]-propionic acid | CHEMBL60090
Type:
Small organic molecule
Emp. Form.:
C25H32O2S
Mol. Mass.:
396.585
SMILES:
CC1(C)CCC(C)(C)c2cc(ccc12)C1CCCc2sc(CCC(O)=O)cc12
: