Target
Retinoic acid receptor alpha
Ligand
BDBM50409929
Substrate
Meas. Tech.
ChEMBL_197411 (CHEMBL799800)
Ki
>1000±n/a nM
Citation
 Haffner, CDLenhard, JMMiller, ABMcDougald, DLDwornik, KIttoop, ORGampe, RTXu, HEBlanchard, SMontana, VGConsler, TGBledsoe, RKAyscue, ACroom, D Structure-based design of potent retinoid X receptor alpha agonists. J Med Chem 47:2010-29 (2004)  
Target
Name:
Retinoic acid receptor alpha
Synonyms:
NR1B1 RAR-alpha RARA_HUMAN Retinoic acid receptor alpha/Retinoid X receptor alpha Retinoid receptor
Type:
PROTEIN
Mol. Mass.:
50778.87
Organism:
Homo sapiens (Human)
Description:
ChEMBL_1466191
Residue:
462
  
Inhibitor
Name:
BDBM50409929
Synonyms:
CHEMBL2113736
Type:
Small organic molecule
Emp. Form.:
C25H31NO3
Mol. Mass.:
393.5185
SMILES:
CN1CC(c2cc(\C=C\C(O)=O)oc2C1)c1ccc2c(c1)C(C)(C)CCC2(C)C
: