Target
Bifunctional epoxide hydrolase 2
Ligand
BDBM50143927
Substrate
Meas. Tech.
ChEMBL_67377 (CHEMBL677487)
IC50
50±n/a nM
Citation
 Kim, IHMorisseau, CWatanabe, THammock, BD Design, synthesis, and biological activity of 1,3-disubstituted ureas as potent inhibitors of the soluble epoxide hydrolase of increased water solubility. J Med Chem 47:2110-22 (2004)  
Target
Name:
Bifunctional epoxide hydrolase 2
Synonyms:
Eph2 Epoxide hydratase Soluble epoxide hydrolase (sEH)
Type:
Enzyme
Mol. Mass.:
62512.06
Organism:
Mus musculus (Mouse)
Description:
P34914
Residue:
554
  
Inhibitor
Name:
BDBM50143927
Synonyms:
8-[4-(3-Adamantan-1-yl-ureido)-butyryloxy]-octanoic acid ethyl ester | CHEMBL302704
Type:
Small organic molecule
Emp. Form.:
C25H42N2O5
Mol. Mass.:
450.6114
SMILES:
CCOC(=O)CCCCCCCOC(=O)CCCNC(=O)NC12CC3CC(CC(C3)C1)C2
: