Target
Bifunctional epoxide hydrolase 2
Ligand
BDBM50143933
Substrate
Meas. Tech.
ChEMBL_67375 (CHEMBL677485)
IC50
130±n/a nM
Citation
 Kim, IHMorisseau, CWatanabe, THammock, BD Design, synthesis, and biological activity of 1,3-disubstituted ureas as potent inhibitors of the soluble epoxide hydrolase of increased water solubility. J Med Chem 47:2110-22 (2004)  
Target
Name:
Bifunctional epoxide hydrolase 2
Synonyms:
Cytosolic epoxide hydrolase 2 EPHX2 HYES_HUMAN Soluble epoxide hydrolase (sEH) | epoxide hydrolase 2, cytoplasmic
Type:
Enzyme
Mol. Mass.:
62613.07
Organism:
Homo sapiens (Human)
Description:
P34913
Residue:
555
  
Inhibitor
Name:
BDBM50143933
Synonyms:
5-[4-(3-Adamantan-1-yl-ureido)-butyryloxy]-pentanoic acid ethyl ester | CHEMBL302116
Type:
Small organic molecule
Emp. Form.:
C22H36N2O5
Mol. Mass.:
408.5316
SMILES:
CCOC(=O)CCCCOC(=O)CCCNC(=O)NC12CC3CC(CC(C3)C1)C2
: