Target
Bifunctional epoxide hydrolase 2
Ligand
BDBM50143941
Substrate
Meas. Tech.
ChEMBL_67375 (CHEMBL677485)
IC50
100±n/a nM
Citation
 Kim, IHMorisseau, CWatanabe, THammock, BD Design, synthesis, and biological activity of 1,3-disubstituted ureas as potent inhibitors of the soluble epoxide hydrolase of increased water solubility. J Med Chem 47:2110-22 (2004)  
Target
Name:
Bifunctional epoxide hydrolase 2
Synonyms:
Cytosolic epoxide hydrolase 2 EPHX2 HYES_HUMAN Soluble epoxide hydrolase (sEH) | epoxide hydrolase 2, cytoplasmic
Type:
Enzyme
Mol. Mass.:
62613.07
Organism:
Homo sapiens (Human)
Description:
P34913
Residue:
555
  
Inhibitor
Name:
BDBM50143941
Synonyms:
12-[4-(3-Adamantan-1-yl-ureido)-butyryloxy]-dodecanoic acid ethyl ester | CHEMBL67041
Type:
Small organic molecule
Emp. Form.:
C29H50N2O5
Mol. Mass.:
506.7177
SMILES:
CCOC(=O)CCCCCCCCCCCOC(=O)CCCNC(=O)NC12CC3CC(CC(C3)C1)C2
: