Target
Glucagon receptor
Ligand
BDBM50144001
Substrate
Meas. Tech.
ChEBML_72991
Ki
6±n/a nM
Citation
 Kurukulasuriya, RSorensen, BKLink, JTPatel, JRJae, HSWinn, MXRohde, JRGrihalde, NDLin, CWOgiela, CAAdler, ALCollins, CA Biaryl amide glucagon receptor antagonists. Bioorg Med Chem Lett 14:2047-50 (2004)  
Target
Name:
Glucagon receptor
Synonyms:
GCGR GLR_HUMAN Glucagon receptor (GlucR)
Type:
Enzyme
Mol. Mass.:
54026.92
Organism:
Homo sapiens (Human)
Description:
P47871
Residue:
477
  
Inhibitor
Name:
BDBM50144001
Synonyms:
3-{4-[1-(2',4'-Dichloro-biphenyl-4-ylcarbamoyl)-heptyloxy]-benzoylamino}-propionic acid | CHEMBL66087
Type:
Small organic molecule
Emp. Form.:
C30H32Cl2N2O5
Mol. Mass.:
571.491
SMILES:
CCCCCCC(Oc1ccc(cc1)C(=O)NCCC(O)=O)C(=O)Nc1ccc(cc1)-c1ccc(Cl)cc1Cl
: