Target
Mu-type opioid receptor
Ligand
BDBM50144229
Substrate
Meas. Tech.
ChEBML_149323
Ki
322±n/a nM
Citation
 Carson, JRCoats, SJCodd, EEDax, SLLee, JMartinez, RPNeilson, LAPitis, PMZhang, SP N,N-dialkyl-4-[(8-azabicyclo[3.2.1]-oct-3-ylidene)phenylmethyl]benzamides, potent, selective delta opioid agonists. Bioorg Med Chem Lett 14:2109-12 (2004)  
Target
Name:
Mu-type opioid receptor
Synonyms:
M-OR-1 MOR-1 MUOR1 Mu opiate receptor OPRM1 hMOP | mu-type opioid receptor isoform MOR-1
Type:
G Protein-Coupled Receptor (GPCR)
Mol. Mass.:
44789.51
Organism:
Homo sapiens (Human)
Description:
P35372
Residue:
400
  
Inhibitor
Name:
BDBM50144229
Synonyms:
4-{[(1S,5R)-8-Allyl-8-aza-bicyclo[3.2.1]oct-(3Z)-ylidene]-phenyl-methyl}-N,N-diethyl-benzamide | CHEMBL63732
Type:
Small organic molecule
Emp. Form.:
C28H34N2O
Mol. Mass.:
414.5824
SMILES:
CCN(CC)C(=O)c1ccc(cc1)C(=C1\C[C@@H]2CC[C@H](C1)N2CC=C)\c1ccccc1
: