Target
Integrin alpha-4/beta-1
Ligand
BDBM50144789
Substrate
Meas. Tech.
ChEMBL_213403 (CHEMBL815426)
IC50
0.740000±n/a nM
Citation
 Lin, LSLanza, TJCastonguay, LAKamenecka, TMcCauley, EVan Riper, GEgger, LAMumford, RATong, XMacCoss, MSchmidt, JAHagmann, WK Bioisosteric replacement of anilide with benzoxazole: potent and orally bioavailable antagonists of VLA-4. Bioorg Med Chem Lett 14:2331-4 (2004)  
Target
Name:
Integrin alpha-4/beta-1
Synonyms:
Fibronectin receptor beta/Integrin alpha-4 | Integrin alpha-4/beta-1
Type:
Mol. Mass.:
Description:
ASSAY_ID of EBI is 88912
Components:
This complex has 2 components.
Component 1
Name:
Integrin beta-1
Synonyms:
CD_antigen=CD29 Fibronectin receptor beta GPIIA ITGB1 MDF2 | MSK12
Type:
Enzyme
Mol. Mass.:
88400.38
Organism:
Homo sapiens (Human)
Description:
P05556
Residue:
798
  
Component 2
Name:
Integrin alpha-4
Synonyms:
CD49 antigen-like family member D CD49d antigen ITA4_HUMAN Integrin alpha-4 Integrin alpha-IV VLA-4 integrin alpha 4 precursor | integrin alpha-4 precursor
Type:
Membrane Protein
Mol. Mass.:
114897.35
Organism:
Homo sapiens (Human)
Description:
P13612
Residue:
1032
  
Inhibitor
Name:
BDBM50144789
Synonyms:
(S)-2-{[(S)-1-(3,5-Dichloro-benzenesulfonyl)-azetidine-2-carbonyl]-amino}-3-[2-(2,6-dichloro-phenyl)-benzooxazol-5-yl]-propionic acid | CHEMBL77924
Type:
Small organic molecule
Emp. Form.:
C26H19Cl4N3O6S
Mol. Mass.:
643.323
SMILES:
OC(=O)[C@H](Cc1ccc2oc(nc2c1)-c1c(Cl)cccc1Cl)NC(=O)[C@@H]1CCN1S(=O)(=O)c1cc(Cl)cc(Cl)c1
: