Target
5-hydroxytryptamine receptor 2C
Ligand
BDBM50144839
Substrate
Meas. Tech.
ChEBML_2970
EC50
21±n/a nM
Citation
 Bentley, JMAdams, DRBebbington, DBenwell, KRBickerdike, MJDavidson, JEDawson, CEDourish, CTDuncton, MAGaur, SGeorge, ARGiles, PRHamlyn, RJKennett, GAKnight, ARMalcolm, CSMansell, HLMisra, AMonck, NJPratt, RMQuirk, KRoffey, JRVickers, SPCliffe, IA Indoline derivatives as 5-HT(2C) receptor agonists. Bioorg Med Chem Lett 14:2367-70 (2004)  
Target
Name:
5-hydroxytryptamine receptor 2C
Synonyms:
5-HT-2C 5-HT2C-INI 5-HTR2C 5-hydroxytryptamine receptor 2C (5-HT-2C) 5HT-1C HTR1C Serotonin (5-HT3) receptor Serotonin Receptor 2C
Type:
G Protein-Coupled Receptor (GPCR)
Mol. Mass.:
51836.79
Organism:
Homo sapiens (Human)
Description:
P28335
Residue:
458
  
Inhibitor
Name:
BDBM50144839
Synonyms:
(S)-2-(6-Ethylsulfanyl-5-fluoro-2,3-dihydro-indol-1-yl)-1-methyl-ethylamine | CHEMBL80731
Type:
Small organic molecule
Emp. Form.:
C13H19FN2S
Mol. Mass.:
254.367
SMILES:
CCSc1cc2N(C[C@H](C)N)CCc2cc1F
: