Target
5-hydroxytryptamine receptor 2A
Ligand
BDBM50144837
Substrate
Meas. Tech.
ChEMBL_2292 (CHEMBL617077)
Ki
364±n/a nM
Citation
 Bentley, JMAdams, DRBebbington, DBenwell, KRBickerdike, MJDavidson, JEDawson, CEDourish, CTDuncton, MAGaur, SGeorge, ARGiles, PRHamlyn, RJKennett, GAKnight, ARMalcolm, CSMansell, HLMisra, AMonck, NJPratt, RMQuirk, KRoffey, JRVickers, SPCliffe, IA Indoline derivatives as 5-HT(2C) receptor agonists. Bioorg Med Chem Lett 14:2367-70 (2004)  
Target
Name:
5-hydroxytryptamine receptor 2A
Synonyms:
5-HT-2 5-HT2A 5-hydroxytryptamine receptor 2A (5HT-2A) 5HT2A_HUMAN HTR2A | Serotonin receptor 2A
Type:
undefined
Mol. Mass.:
52607.65
Organism:
Homo sapiens (Human)
Description:
P28223
Residue:
471
  
Inhibitor
Name:
BDBM50144837
Synonyms:
(S)-2-(6-Chloro-2,3-dihydro-indol-1-yl)-1-methyl-ethylamine | CHEMBL76307
Type:
Small organic molecule
Emp. Form.:
C11H15ClN2
Mol. Mass.:
210.703
SMILES:
C[C@H](N)CN1CCc2ccc(Cl)cc12
: