Target
GABA-A receptor; alpha-5/beta-3/gamma-2
Ligand
BDBM50144862
Substrate
Meas. Tech.
ChEMBL_70554 (CHEMBL682082)
Ki
2.9±n/a nM
Citation
 Sternfeld, FCarling, RWJelley, RALadduwahetty, TMerchant, KJMoore, KWReeve, AJStreet, LJO'Connor, DSohal, BAtack, JRCook, SSeabrook, GWafford, KTattersall, FDCollinson, NDawson, GRCastro, JLMacLeod, AM Selective, orally active gamma-aminobutyric acidA alpha5 receptor inverse agonists as cognition enhancers. J Med Chem 47:2176-9 (2004)  
Target
Name:
GABA-A receptor; alpha-5/beta-3/gamma-2
Synonyms:
GABA receptor alpha-5/beta-3/gamma-2 subunit | Gamma-aminobutyric acid receptor subunit alpha-5/beta-3/gamma-2
Type:
Mol. Mass.:
Description:
ASSAY_ID of ChEMBL is 2148177
Components:
This complex has 3 components.
Component 1
Name:
Gamma-aminobutyric acid receptor subunit gamma-2
Synonyms:
GABA(A) receptor subunit gamma-2 GBRG2_HUMAN
Type:
PROTEIN
Mol. Mass.:
54172.74
Organism:
Homo sapiens (Human)
Description:
EBI_217
Residue:
467
  
Component 2
Name:
Gamma-aminobutyric acid receptor subunit beta-3
Synonyms:
GABA A receptor alpha-4/beta-3/gamma-2 GABA-A receptor GBRB3_HUMAN | agonist GABA site
Type:
PROTEIN
Mol. Mass.:
54130.51
Organism:
Homo sapiens (Human)
Description:
ChEMBL_448071
Residue:
473
  
Component 3
Name:
Gamma-aminobutyric acid receptor subunit alpha-5
Synonyms:
GABA receptor alpha-5 subunit GABRA5 Gamma-aminobutyric acid receptor subunit alpha-5 (GABA(A)) | Gamma-aminobutyric acid receptor subunit alpha-5 (GABAA)
Type:
Enzyme
Mol. Mass.:
52160.59
Organism:
Homo sapiens (Human)
Description:
P31644
Residue:
462
  
Inhibitor
Name:
BDBM50144862
Synonyms:
6-methyl-2-pyridyl 6-phenyl-4,5,7,8-tetraazatetracyclo[9.2.2.02,10.03,7]pentadeca-2(10),3,5,8-tetraen-9-yl ether CHEMBL68712
Type:
Small organic molecule
Emp. Form.:
C24H23N5O
Mol. Mass.:
397.4723
SMILES:
Cc1cccc(COc2nn3c(nnc3c3C4CCC(CC4)c23)-c2ccccc2)n1
: