Target
Adenosine receptor A3
Ligand
BDBM50145226
Substrate
Meas. Tech.
ChEBML_31841
IC50
260±n/a nM
Citation
 Okamura, TKurogi, YHashimoto, KNishikawa, HNagao, Y Facile synthesis of fused 1,2,4-triazolo[1,5-c]pyrimidine derivatives as human adenosine A3 receptor ligands. Bioorg Med Chem Lett 14:2443-6 (2004)  
Target
Name:
Adenosine receptor A3
Synonyms:
A3 adenosine receptor (hA3) ADORA3 | Adenosine A3 receptor (A3AR)
Type:
G Protein-Coupled Receptor (GPCR)
Mol. Mass.:
36197.32
Organism:
Homo sapiens (Human)
Description:
P0DMS8
Residue:
318
  
Inhibitor
Name:
BDBM50145226
Synonyms:
5-Butyl-2-phenyl-[1,2,4]triazolo[1,5-c]quinazoline | CHEMBL340580
Type:
Small organic molecule
Emp. Form.:
C19H18N4
Mol. Mass.:
302.373
SMILES:
CCCCc1nc2ccccc2c2nc(nn12)-c1ccccc1
: