Target
Caspase-8
Ligand
BDBM50145622
Substrate
Meas. Tech.
ChEBML_46849
IC50
7.0±n/a nM
Citation
 Linton, SDAja, TAllegrini, PRDeckwerth, TLDiaz, JLHengerer, BHerrmann, JJahangiri, KGKallen, JKaranewsky, DSMeduna, SPNalley, KRobinson, EDRoggo, SRovelli, GSauter, ASayers, ROSchmitz, ASmidt, RTernansky, RJTomaselli, KJUllman, BRWiessner, CWu, JC Oxamyl dipeptide caspase inhibitors developed for the treatment of stroke. Bioorg Med Chem Lett 14:2685-91 (2004)  
Target
Name:
Caspase-8
Synonyms:
Apoptotic cysteine protease CAP4 CASP8 Caspase Caspase-8 subunit p18 FADD-like ICE ICE-like apoptotic protease 5 MCH5 | MORT1-associated CED-3 homolog
Type:
Enzyme
Mol. Mass.:
55373.89
Organism:
Homo sapiens (Human)
Description:
Q14790
Residue:
479
  
Inhibitor
Name:
BDBM50145622
Synonyms:
(S)-3-{(S)-4-Methyl-2-[2-(naphthalen-1-ylamino)-acetylamino]-pentanoylamino}-4-oxo-butyric acid | CHEMBL90224
Type:
Small organic molecule
Emp. Form.:
C22H27N3O5
Mol. Mass.:
413.4669
SMILES:
CC(C)C[C@H](NC(=O)CNc1cccc2ccccc12)C(=O)N[C@@H](CC(O)=O)C=O
: