Target
Caspase-1
Ligand
BDBM50145622
Substrate
Meas. Tech.
ChEBML_46513
IC50
33±n/a nM
Citation
 Linton, SDAja, TAllegrini, PRDeckwerth, TLDiaz, JLHengerer, BHerrmann, JJahangiri, KGKallen, JKaranewsky, DSMeduna, SPNalley, KRobinson, EDRoggo, SRovelli, GSauter, ASayers, ROSchmitz, ASmidt, RTernansky, RJTomaselli, KJUllman, BRWiessner, CWu, JC Oxamyl dipeptide caspase inhibitors developed for the treatment of stroke. Bioorg Med Chem Lett 14:2685-91 (2004)  
Target
Name:
Caspase-1
Synonyms:
CASP1_MOUSE Il1bc
Type:
PROTEIN
Mol. Mass.:
45636.44
Organism:
Mus musculus
Description:
ChEMBL_651546
Residue:
402
  
Inhibitor
Name:
BDBM50145622
Synonyms:
(S)-3-{(S)-4-Methyl-2-[2-(naphthalen-1-ylamino)-acetylamino]-pentanoylamino}-4-oxo-butyric acid | CHEMBL90224
Type:
Small organic molecule
Emp. Form.:
C22H27N3O5
Mol. Mass.:
413.4669
SMILES:
CC(C)C[C@H](NC(=O)CNc1cccc2ccccc12)C(=O)N[C@@H](CC(O)=O)C=O
: