Target
Peroxisome proliferator-activated receptor gamma
Ligand
BDBM50145720
Substrate
Meas. Tech.
ChEMBL_153619 (CHEMBL760384)
IC50
2241±n/a nM
Citation
 Xu, YRito, CJEtgen, GJArdecky, RJBean, JSBensch, WRBosley, JRBroderick, CLBrooks, DADominianni, SJHahn, PJLiu, SMais, DEMontrose-Rafizadeh, COgilvie, KMOldham, BAPeters, MRungta, DKShuker, AJStephenson, GATripp, AEWilson, SBWinneroski, LLZink, RKauffman, RFMcCarthy, JR Design and synthesis of alpha-aryloxy-alpha-methylhydrocinnamic acids: a novel class of dual peroxisome proliferator-activated receptor alpha/gamma agonists. J Med Chem 47:2422-5 (2004)  
Target
Name:
Peroxisome proliferator-activated receptor gamma
Synonyms:
NR1C3 PPAR-gamma PPARG_HUMAN Peroxisome proliferator-activated receptor gamma (PPAR gamma) Peroxisome proliferator-activated receptor gamma (PPARĪ³) peroxisome proliferator-activated receptor gamma isoform 2
Type:
Nuclear Receptor
Mol. Mass.:
57613.46
Organism:
Homo sapiens (Human)
Description:
P37231
Residue:
505
  
Inhibitor
Name:
BDBM50145720
Synonyms:
2-{4-[2-(5-Methyl-2-phenyl-oxazol-4-yl)-ethoxy]-benzyl}-2-phenoxy-hexanoic acid | CHEMBL82193
Type:
Small organic molecule
Emp. Form.:
C31H33NO5
Mol. Mass.:
499.5974
SMILES:
CCCCC(Cc1ccc(OCCc2nc(oc2C)-c2ccccc2)cc1)(Oc1ccccc1)C(O)=O
: