Target
Peroxisome proliferator-activated receptor alpha
Ligand
BDBM50145720
Substrate
Meas. Tech.
ChEMBL_153405 (CHEMBL764507)
IC50
1846±n/a nM
Citation
 Xu, YRito, CJEtgen, GJArdecky, RJBean, JSBensch, WRBosley, JRBroderick, CLBrooks, DADominianni, SJHahn, PJLiu, SMais, DEMontrose-Rafizadeh, COgilvie, KMOldham, BAPeters, MRungta, DKShuker, AJStephenson, GATripp, AEWilson, SBWinneroski, LLZink, RKauffman, RFMcCarthy, JR Design and synthesis of alpha-aryloxy-alpha-methylhydrocinnamic acids: a novel class of dual peroxisome proliferator-activated receptor alpha/gamma agonists. J Med Chem 47:2422-5 (2004)  
Target
Name:
Peroxisome proliferator-activated receptor alpha
Synonyms:
NR1C1 PPAR PPAR-alpha PPARA_HUMAN Peroxisome proliferator-activated receptor | Peroxisome proliferator-activated receptor alpha (PPAR alpha)
Type:
Enzyme
Mol. Mass.:
52222.08
Organism:
Homo sapiens (Human)
Description:
Q07869
Residue:
468
  
Inhibitor
Name:
BDBM50145720
Synonyms:
2-{4-[2-(5-Methyl-2-phenyl-oxazol-4-yl)-ethoxy]-benzyl}-2-phenoxy-hexanoic acid | CHEMBL82193
Type:
Small organic molecule
Emp. Form.:
C31H33NO5
Mol. Mass.:
499.5974
SMILES:
CCCCC(Cc1ccc(OCCc2nc(oc2C)-c2ccccc2)cc1)(Oc1ccccc1)C(O)=O
: