Target
Retinoic acid receptor RXR-alpha
Ligand
BDBM50146329
Substrate
Meas. Tech.
ChEMBL_196624 (CHEMBL800659)
Ki
648±n/a nM
Citation
 Gernert, DLNeel, DABoehm, MFLeibowitz, MDMais, DAMichellys, PYRungta, DReifel-Miller, AGrese, TA Design and synthesis of benzofused heterocyclic RXR modulators. Bioorg Med Chem Lett 14:2759-63 (2004)  
Target
Name:
Retinoic acid receptor RXR-alpha
Synonyms:
NR2B1 Nuclear receptor subfamily 4 group A member 2 RXRA Retinoic acid receptor RXR-alpha/gamma Retinoid receptor
Type:
PROTEIN
Mol. Mass.:
50820.38
Organism:
Homo sapiens (Human)
Description:
ChEMBL_1456363
Residue:
462
  
Inhibitor
Name:
BDBM50146329
Synonyms:
(E)-3-[3-(2-Ethoxy-3,5-diisopropyl-phenyl)-benzo[d]isoxazol-5-yl]-but-2-enoic acid | CHEMBL328507
Type:
Small organic molecule
Emp. Form.:
C25H29NO4
Mol. Mass.:
407.5021
SMILES:
CCOc1c(cc(cc1-c1noc2ccc(cc12)C(\C)=C\C(O)=O)C(C)C)C(C)C
: