Target
Integrin alpha-V/beta-3
Ligand
BDBM50146497
Substrate
Meas. Tech.
ChEMBL_32659 (CHEMBL642827)
Ki
0.700000±n/a nM
Citation
 Xi, NArvedson, SEisenberg, SHan, NHandley, MHuang, LHuang, QKiselyov, ALiu, QLu, YNunez, GOsslund, TPowers, DTasker, ASWang, LXiang, TXu, SZhang, JZhu, JKendall, RDominguez, C N-Aryl-gamma-lactams as integrin alphavbeta3 antagonists. Bioorg Med Chem Lett 14:2905-9 (2004)  
Target
Name:
Integrin alpha-V/beta-3
Synonyms:
ITGAV/ITGB3 | Integrin beta-3/Vitronectin receptor alpha
Type:
Enzyme
Mol. Mass.:
Description:
Components:
This complex has 2 components.
Component 1
Name:
Integrin alpha-V
Synonyms:
ITAV_HUMAN Integrin alpha-V/alpha-5 VNRA Vitronectin receptor | Vitronectin receptor subunit alpha
Type:
PROTEIN
Mol. Mass.:
116024.92
Organism:
Homo sapiens (Human)
Description:
ChEMBL_582336
Residue:
1048
  
Component 2
Name:
Integrin beta-3
Synonyms:
CD_antigen=CD61 GPIIIa ITGB3 Platelet membrane glycoprotein IIIa
Type:
Protein
Mol. Mass.:
87038.91
Organism:
Homo sapiens (Human)
Description:
P05106
Residue:
788
  
Inhibitor
Name:
BDBM50146497
Synonyms:
3-Benzo[1,3]dioxol-5-yl-3-({5-oxo-1-[3-(1,4,5,6-tetrahydro-pyrimidin-2-ylamino)-phenyl]-pyrrolidine-3-carbonyl}-amino)-propionic acid | CHEMBL98776
Type:
Small organic molecule
Emp. Form.:
C25H27N5O6
Mol. Mass.:
493.5118
SMILES:
OC(=O)CC(NC(=O)C1CN(C(=O)C1)c1cccc(NC2=NCCCN2)c1)c1ccc2OCOc2c1
: