Target
Sodium-dependent serotonin transporter
Ligand
BDBM50146516
Substrate
Meas. Tech.
ChEBML_201481
Ki
22±n/a nM
Citation
 Pastor, JAlcázar, JAlvarez, RMAndrés, JICid, JMDe Lucas, AIDíaz, AFernández, JFont, LMIturrino, LLafuente, CMartínez, SBakker, MHBiesmans, IHeylen, LIMegens, AA Synthesis of 3a,4-dihydro-3H-[1]benzopyrano[4,3-c]isoxazoles, displaying combined 5-HT uptake inhibiting and alpha2-adrenoceptor antagonistic activities. Part 2: Further exploration on the cinnamyl moiety. Bioorg Med Chem Lett 14:2917-22 (2004)  
Target
Name:
Sodium-dependent serotonin transporter
Synonyms:
5-HT Transporter 5HTT SC6A4_HUMAN SLC6A4 Serotonin transporter (5HTT) Sodium-dependent serotonin transporter (SERT) | Solute carrier family 6 member 4
Type:
Multi-pass membrane protein
Mol. Mass.:
70322.51
Organism:
Homo sapiens (Human)
Description:
P31645
Residue:
630
  
Inhibitor
Name:
BDBM50146516
Synonyms:
(3R,3aS)-3-[4-(3-Furan-2-yl-but-2-enyl)-piperazin-1-ylmethyl]-7,8-dimethoxy-3a,4-dihydro-3H-chromeno[4,3-c]isoxazole | CHEMBL319530
Type:
Small organic molecule
Emp. Form.:
C25H31N3O5
Mol. Mass.:
453.5307
SMILES:
COc1cc2OC[C@H]3[C@H](CN4CCN(C\C=C(/C)c5ccco5)CC4)ON=C3c2cc1OC
: